{"text_format":"1","workbook":"xlsx","n_sheets":12,"sheets":["Main","PlanLægning","Lufttabel","Trindekompression","Setup","Ilt forbrug","Ark2","Logblad","PADI lufttabel","Dykkerlederjournal","Todo","trimix"],"not_rendered":{"charts":0,"images":11,"macros":1,"external_links":0,"defined_names":7,"comments":0,"pivot_tables":0},"unopened":[],"bounds":{"document_bytes":16777216,"sheet_cells":100000,"rows_first":2000,"rows_last":500,"rows_between":2000,"halvings":0,"cell_chars":16384,"cell_head_chars":4096},"cells_cut":0,"cells_raw":0,"read":"whole","date_system":"1900"}

{"sheet":"Main","index":0,"n_rows":42,"n_cols":17,"rows_kept":42,"cut":false,"hidden":false,"merged":[[21,12,21,13],[19,12,19,13],[36,7,36,9],[37,7,37,9],[0,0,0,2],[12,1,12,3],[13,1,13,3],[14,1,14,3],[32,1,32,3],[18,1,18,3],[19,1,19,3],[21,1,21,3],[22,1,22,3],[9,7,9,9],[10,1,10,3],[11,4,11,6],[11,1,11,3],[9,1,9,3],[9,4,9,6],[10,4,10,6],[10,7,10,9],[11,7,11,9],[18,7,18,9],[33,1,33,3],[35,1,35,3],[12,7,12,9],[13,7,13,9],[14,7,14,9],[15,7,15,9],[16,7,16,9],[15,1,15,3],[12,4,12,6],[13,4,13,6],[14,4,14,6],[15,4,15,6],[17,1,17,3],[16,1,16,3],[16,4,16,6],[18,4,18,6],[41,1,41,3],[39,4,39,6],[40,4,40,6],[41,4,41,6],[37,1,37,3],[33,4,33,6],[34,4,34,6],[35,4,35,6],[36,4,36,6],[37,4,37,6],[32,4,32,6],[40,7,40,9],[41,7,41,9],[40,1,40,3],[19,7,19,9],[21,7,21,9],[22,7,22,9],[39,1,39,3],[38,4,38,6],[39,7,39,9],[19,4,19,6],[21,4,21,6],[22,4,22,6],[38,7,38,9],[33,7,33,9],[34,7,34,9],[35,7,35,9]]}
["Dyklog version 0.0.11 (21-10-2017)"]
[null,null,null,null,null,null,null,null,null,null,null,null,null,null,"Tryk på smileyen for at regne"]
[]
["Flaskestørrelse [L]",15]
["Flasketryk [bar]",200]
["Flasketryk [bar]",100]
["Luftforbrug"]
[]
[]
["Input","1. dyk",null,null,"2. dyk",null,null,"3. dyk",null,null,null,"Ikke flere dyk i dag ;-)"]
["Ioverfladen kl.:",null,null,null,{"$f":"B15","v":"10:46:00"},null,null,{"$f":"E15","v":"12:51:00"}]
["neddykning kl.:","10:15:00",null,null,"12:10:00",null,null,"14:30:00"]
["Bundtid [minutter]",10,null,null,30,null,null,16]
["Samlet opstigningstid [minutter]",{"$f":"B33+B35+B37+B39+B41+B42","v":{"$error":"#VALUE!"}},null,null,{"$f":"E36+E38+E40+E41+E42","v":6}]
["Ioverfladen kl.:","10:46:00",null,null,"12:51:00"]
["Mætningsgr.:",{"$f":"IF(B20>O22,Trindekompression!K44,Lufttabel!G21)","v":"D"},null,null,{"$f":"Lufttabel!H21","v":"E"},null,null,{"$f":"Lufttabel!K21","v":0}]
["interval:[timer:min]",null,null,null,{"$f":"E12-E11","v":"01:24:00"},null,null,{"$f":"H12-H11","v":"01:39:00"}]
["Ny mætningsgruppe:",null,null,null,{"$f":"B16","v":"D"},"a",{"$f":"Lufttabel!G26","v":"A"},{"$f":"E16","v":"E"},"a",{"$f":"Lufttabel!I26","v":"A"}]
["Forbelastning: [minutter]",null,null,null,{"$f":"Lufttabel!G37","v":14},null,null,{"$f":"Lufttabel!L37","v":9}]
["Nitrogentid: [minutter]",{"$f":"B13+B19","v":10},null,null,{"$f":"E13+E19","v":44},null,null,{"$f":"H13+H19","v":25},null,null,null,null,null,null,"1 dyk","2 dyk","3 dyk"]
[]
["Dybde [meter]",30,null,null,19,null,null,31,null,null,null,null,"maks nitrogentid:",null,{"$f":"LOOKUP(Lufttabel!W3,Lufttabel!$U$14:$U$25,Lufttabel!$V$14:$V$25)","v":35},{"$f":"LOOKUP(Lufttabel!X3,Lufttabel!$U$14:$U$25,Lufttabel!$V$14:$V$25)","v":51},{"$f":"IFERROR(LOOKUP(Lufttabel!Y3,Lufttabel!$U$14:$U$25,Lufttabel!$V$14:$V$25),\"\")","v":17}]
["Dykketid",{"$f":"B13+B14","v":{"$error":"#VALUE!"}},null,null,{"$f":"E13+E14","v":36}]
[]
["gentagn. Dyk"]
[]
[]
[]
[]
["Output"]
["Dykkerprofil  [minutter]"]
[null,{"$f":"B22-IF(Trindekompression!K40<>0,12,IF(Trindekompression!K41<>0,9,\"\"))","v":{"$error":"#VALUE!"}},null,null,{"$f":"B32/10","v":{"$error":"#VALUE!"}}]
["Opstigning til førstestop:",{"$f":"IF(Lufttabel!W7>LOOKUP(Lufttabel!W7,Lufttabel!U14:U25,Lufttabel!V14:V25),IF(Trindekompression!K40<>0,ROUNDUP((Main!B22-12)/10,0),IF(Trindekompression!K41<>0,ROUNDUP((Main!B22-9)/10,0),IF(Trindekompression!K42<>0,ROUNDUP((Main!B22-6)/10,0),\"\"))),ROUNDUP((B22-4.5)/10,0))","v":""},null,null,3]
[null,{"$f":"IF(Main!$B$20>VLOOKUP(Lufttabel!$W$3,Lufttabel!$U$14:$V$24,2,0),ROUNDUP((B22-12)/10,0),\"\")","v":""}]
["12 meter dekostop"]
[]
["9 meter dekostop"]
[]
["6 meter dekostop"]
[null,null,null,null,{"$f":"ROUNDUP((E22-4.5)/10,0)","v":2}]
["4,5 meter dekostop",{"$f":"Trindekompression!K43","v":10},null,null,3]
["opst til overfladen",1,null,null,1,null,null,1]

{"sheet":"PlanLægning","index":1,"n_rows":48,"n_cols":24,"rows_kept":48,"cut":false,"hidden":false,"merged":[[46,9,46,11],[7,0,7,13],[0,1,0,3],[2,0,2,13],[33,13,34,13],[33,1,33,3],[33,5,33,7],[33,9,33,11],[34,1,34,3],[34,5,34,7],[34,9,34,11],[29,1,29,3],[29,5,29,7],[29,9,29,11],[16,1,16,3],[24,1,24,3],[25,1,25,3],[25,5,25,7],[25,9,25,11],[26,1,26,3],[26,5,26,7],[26,9,26,11],[22,1,22,3],[22,9,22,11],[23,1,23,3],[23,5,23,7],[9,1,9,3],[9,5,9,7],[9,9,9,11],[14,1,14,3],[14,5,14,7],[14,9,14,11],[11,5,11,7],[11,9,11,11],[10,1,10,3],[10,5,10,7],[10,9,10,11],[11,1,11,3],[13,1,13,3],[13,5,13,7],[13,9,13,11],[23,9,23,11],[47,1,47,3],[47,5,47,7],[47,9,47,11],[18,1,18,3],[18,5,18,7],[18,9,18,11],[15,1,15,3],[15,5,15,7],[15,9,15,11],[22,5,22,7],[16,9,16,11],[16,5,16,7],[46,1,46,3],[46,5,46,7],[35,5,35,7],[35,9,35,11],[35,1,35,3],[38,1,38,3],[38,5,38,7],[38,9,38,11],[36,5,36,7],[36,9,36,11],[37,5,37,7],[37,9,37,11],[36,1,36,3],[37,1,37,3],[39,5,39,7],[39,9,39,11],[39,1,39,3],[40,1,40,3],[40,5,40,7],[40,9,40,11],[33,15,33,16],[35,15,35,16],[36,15,36,16],[37,15,37,16],[45,1,45,3],[45,5,45,7],[45,9,45,11],[41,1,41,3],[43,1,43,3],[43,5,43,7],[43,9,43,11],[41,5,41,7],[41,9,41,11],[42,1,42,3],[42,5,42,7],[42,9,42,11]]}
["Dyklog version 0.0.12 (",{"$f":"TODAY()","v":"2017-11-06"},null,null,")"]
[]
["Ikke i brug endnu",null,null,null,null,null,null,null,null,null,null,null,null,null,null,null,null,null,null,null,null,null,null,"Tryk på smileyen for at regne"]
["Flaskestørrelse [L]",15]
["Flasketryk [bar]",200]
["Flasketryk [bar]",100]
["Luftforbrug"]
["Dyk Planlægning"]
[]
["Input","1. dyk",null,null,null,"2. dyk",null,null,null,"3. dyk",null,null,null,null,null,"Ikke flere dyk i dag ;-)"]
["Dybde [meter]",20,null,null,null,18,null,null,null,30]
["Bundtid [minutter](ADT)",28,null,null,null,30,null,null,null,8]
[]
[]
["Ioverfladen kl.:",null,null,null,null,{"$f":"B19","v":"10:38:00"},null,null,null,{"$f":"F19","v":"12:51:00"}]
["neddykning kl.:","10:15:00",null,null,null,"12:10:00",null,null,null,"14:30:00"]
["Aftalt op klokken",{"$f":"B16+TIME(0,B30,0)","v":"10:49:00"},null,null,null,{"$f":"F16+TIME(0,F30,0)","v":"12:46:00"},null,null,null,{"$f":"J16+TIME(0,J30,0)","v":"14:45:00"}]
[]
["Ioverfladen kl.:","10:38:00",null,null,null,"12:51:00",null,null,null,"14:48:00"]
[]
["Output"]
[]
["Mætningsgr.:",{"$f":"IF(B27>R36,Trindekompression!K44,Lufttabel!G21)","v":"D"},null,null,null,{"$f":"Lufttabel!H21","v":"E"},null,null,null,{"$f":"Lufttabel!I21","v":"D"}]
["interval:[timer:min](SIT)",null,null,null,null,{"$f":"F16-F15","v":"01:32:00"},null,null,null,{"$f":"J16-J15","v":"01:39:00"}]
["Ny mætningsgruppe:",null,null,null,null,{"$f":"B23","v":"D"},"a",{"$f":"Lufttabel!G26","v":"A"},null,{"$f":"F23","v":"E"},"a",{"$f":"Lufttabel!I26","v":"A"}]
["Forbelastning: [minutter](RNT)",0,null,null,null,{"$f":"Lufttabel!G37","v":14},null,null,null,{"$f":"Lufttabel!L37","v":9}]
["Nitrogentid: [minutter](TNT)",{"$f":"B12+B26","v":28},null,null,null,{"$f":"F12+F26","v":44},null,null,null,{"$f":"J12+J26","v":17}]
[]
[]
["Dykketid",{"$f":"B12+B48","v":34},null,null,null,{"$f":"F12+F48","v":36},null,null,null,{"$f":"J12+J48","v":15}]
[]
["Dykkerprofil  [minutter]",null,null,null,null,null,null,null,null,null,null,null,null,null,null,null,null,null,null,null,"gentagn. Dyk"]
[]
[null,"1. dyk",null,null,null,"2. dyk",null,null,null,"3. dyk",null,null,null,"Test",null,null,null,"1 dyk","2 dyk","3 dyk"]
[]
["Opstigning til førstestop:",{"$f":"IF(B27>R37,IF(Trindekompression!K40<>0,ROUNDUP((PlanLægning!B11-12)/10,0),IF(Trindekompression!K41<>0,B11/10,IF(Trindekompression!K42<>0,ROUNDUP((PlanLægning!B11-6)/10,0),IF(Trindekompression!K43<>0,ROUNDUP((B11-4.5)/10,0))))),ROUNDUP((B11-4.5)/10,0))","v":2},null,null,null,{"$f":"IF(F27>S37,IF(Trindekompression!L40<>0,ROUNDUP((PlanLægning!F11-12)/10,0),IF(Trindekompression!L41<>0,F11/10,IF(Trindekompression!L42<>0,ROUNDUP((PlanLægning!F11-6)/10,0),IF(Trindekompression!L43<>0,ROUNDUP((F11-4.5)/10,0))))),ROUNDUP((F11-4.5)/10,0))","v":2},null,null,null,{"$f":"IF(J27>T37,IF(Trindekompression!S40<>0,ROUNDUP((PlanLægning!J11-12)/10,0),IF(Trindekompression!S41<>0,J11/10,IF(Trindekompression!S42<>0,ROUNDUP((PlanLægning!J11-6)/10,0),IF(Trindekompression!S43<>0,ROUNDUP((J11-4.5)/10,0))))),ROUNDUP((J11-4.5)/10,0))","v":3},null,null,null,{"$f":"IF(Lufttabel!W7>LOOKUP(Lufttabel!W7,Lufttabel!$U$14:$U$25,Lufttabel!$V$14:$V$25),IF(Trindekompression!K40<>0,ROUNDUP((PlanLægning!B11-12)/10,0),IF(Trindekompression!K41<>0,B11/10,IF(Trindekompression!K42<>0,ROUNDUP((PlanLægning!B11-6)/10,0),\"\"))),ROUNDUP((B11-4.5)/10,0))","v":""},null,"maks nitrogentid:",null,{"$f":"LOOKUP(Lufttabel!W3,Lufttabel!$U$14:$U$25,Lufttabel!$V$14:$V$25)","v":35},{"$f":"LOOKUP(Lufttabel!X3,Lufttabel!$U$14:$U$25,Lufttabel!$V$14:$V$25)","v":51},{"$f":"IFERROR(LOOKUP(Lufttabel!Y3,Lufttabel!$U$14:$U$25,Lufttabel!$V$14:$V$25),\"\")","v":17}]
[null,null,null,null,null,null,null,null,null,null,null,null,null,{"$f":"IF(PlanLægning!$B$27>VLOOKUP(Lufttabel!$W$3,Lufttabel!$U$14:$V$24,2,0),ROUNDUP((B11-12)/10,0),\"\")","v":""},null,"MDT",null,{"$f":"VLOOKUP(Lufttabel!W3,Lufttabel!$U$14:$V$24,2,0)","v":35},{"$f":"VLOOKUP(Lufttabel!X3,Lufttabel!$U$14:$V$24,2,0)","v":51},{"$f":"VLOOKUP(Lufttabel!Y3,Lufttabel!$U$14:$V$24,2,0)","v":17}]
["12 meter dekostop",{"$f":"IF($B$12>$R$37,Trindekompression!K40,0)","v":0},null,null,null,{"$f":"IF($F$12>$S$37,Trindekompression!L40,0)","v":0},null,null,null,null,null,null,null,null,null,"AMDT",null,null,{"$f":"S37-F26","v":37},{"$f":"T37-J26","v":8}]
[]
["9 meter dekostop",{"$f":"IF($B$12>$R$37,Trindekompression!K41,0)","v":0},null,null,null,{"$f":"IF($F$12>$S$37,Trindekompression!L41,0)","v":0}]
[]
["6 meter dekostop",{"$f":"IF($B$12>$R$37,Trindekompression!K42,0)","v":0},null,null,null,{"$f":"IF($F$12>$R$37,Trindekompression!L42,0)","v":0}]
[]
["4,5 meter dekostop",{"$f":"IF($B$12>$R$37,Trindekompression!K43,3)","v":3},null,null,null,{"$f":"IF($F$12>$S$37,Trindekompression!L43,3)","v":3},null,null,null,3]
[]
["opstigning  til overfladen",1,null,null,null,1,null,null,null,1]
[]
["Samlet opstigningstid [minutter]",{"$f":"SUM(B36:D46)","v":6},null,null,null,{"$f":"SUM(F36:H46)","v":6},null,null,null,{"$f":"SUM(J35:M46)","v":7}]

{"sheet":"Lufttabel","index":2,"n_rows":38,"n_cols":27,"rows_kept":38,"cut":false,"hidden":false,"merged":[[25,11,25,20],[36,6,36,7],[36,1,36,5],[23,6,23,7],[23,8,23,9],[1,13,1,19],[2,0,8,0],[2,20,11,20],[12,1,12,10],[12,21,12,23]]}
[]
[null,12,15,18,21,24,27,30,33,36,39,42,null,"Dybde – Mætningsgruppe",null,null,null,null,null,null,null,null,"1.Dyk","2.Dyk","3.Dyk"]
["Bundtid",19,16,14,12,11,10,9,8,7,7,6,null,null,null,null,null,"A","00:00-01:59","02:00","Overfladeinterval",null,{"$f":"MIN(IF(B2:L2>=G18,B2:L2))","v":21},{"$f":"MIN(IF(B2:L2>=H18,B2:L2))","v":18},{"$f":"MIN(IF(B2:L2>=I18,B2:L2))","v":30},"Dybde 17 er ikke tabellagt, derfor nærmeste større tabellagt værdi som er 18."]
[null,25,20,17,15,13,12,11,10,9,8,7,null,null,null,null,"B","00:00-00:19","00:20-01:59","02:00",null,null,{"$f":"MATCH(MIN(IF($B$2:$L$2>=G18,$B$2:$L$2)),$B$2:$L$2,0)","v":4},{"$f":"MATCH(MIN(IF($B$2:$L$2>=H18,$B$2:$L$2)),$B$2:$L$2,0)","v":3},{"$f":"MATCH(MIN(IF($B$2:$L$2>=I18,$B$2:$L$2)),$B$2:$L$2,0)","v":7},"Hvilken kolonne (i tabellen) findes 18 i. "]
[null,37,29,25,22,20,18,16,11,10,9,8,null,null,null,"C","00:00-00:09","00:10-00:24","00:25-02:59","03:00",null,null,{"$f":"LOOKUP(G18,$L$14:$L$25)","v":18},{"$f":"LOOKUP(H18,$L$14:$L$25)","v":18},{"$f":"LOOKUP(I18,$L$14:$L$25)","v":30},"Dybde 17 er ikke tabellagt, derfor nærmeste mindre tabellagt værdi som er 15. til beregning af forbelastning."]
[null,57,41,33,28,24,19,17,14,12,10,9,null,null,"D","00:00-00:09","00:10-00:14","00:15-00:29","00:30-02:59","03:00"]
[null,82,59,44,35,25,20,null,null,null,null,null,null,"E","00:00-00:09","00:10-00:14","00:15-00:24","00:25-00:44","00:45-03:59","04:00",null,null,{"$f":"MIN(IF(INDIRECT(G29,0)>=G19,INDIRECT(G29,0)))","v":28},{"$f":"MIN(IF(INDIRECT(K29,0)>=H19,INDIRECT(K29,0)))","v":33},{"$f":"MIN(IF(INDIRECT(N29,0)>=I19,INDIRECT(N29,0)))","v":9},"Bundtid 30 er ikke tabellagt, derfor nærmeste større tabellagt værdi som er 33."]
[null,111,65,51,null,null,null,null,null,null,null,null,"F","00:00-00:19","00:20-00:29","00:30-00:44","00:45-01:14","01:15-01:29","01:30-07:59","08:00",null,null,{"$f":"MATCH(MIN(IF(D3:D12>=G19,D3:D12)),D3:D12,0)","v":4},{"$f":"MATCH(MIN(IF(E3:E12>=H19,E3:E12)),E3:E12,0)","v":5},{"$f":"MATCH(MIN(IF(F3:F12>=I19,F3:F12)),F3:F12,0)","v":1},"Hvilken række (i kolonne 3 i tabellen) findes 33 i. "]
[null,125,75,null,null,null,null,null,null,null,null,"G","00:00-00:24","00:25:00:44","00:45-00:59","01:00-01:14","01:15:01:39","01:40-02:09","02:10-11:59","12:00"]
[null,null,null,null,null,null,null,null,null,null,null,"H","00:50-01:04","01:05-01:34","01:35-02:09","02:10-02:59","03:00-03:59","04:00-05:39","05:40-23-59","24:00",null,null,null,null,null,"=MATCH(MIN(IF(D3:D12>=G17;D3:D12));D3:D12;0)    =    formel i celle W8."]
[null,null,null,null,null,null,null,null,null,null,null,"K","03:00-03:59","04:00-04:59","05:00-05:59","06:00-06:59","07:00-07:59","08:00-09:19","09:20-38:59","39:00"]
[null,null,null,null,null,null,null,null,null,null,null,"L","06:00-06:59","07:00-09:29","08:30-09:59","10:00-11:59","12:00-13:59","14:00-16:29","16:30-47:59","48:00",null,null,null,null,null,"Når vi har de 4 (W8) så er det bare at bruge en INDEX-funktion som:"]
[null,"Mætningsgruppe efter overfladeinterval",null,null,null,null,null,null,null,null,null,"Meter","G","F","E","D","C","B","A",null,"Meter","Maks tid uden DEKO"]
[null,null,null,null,null,null,null,null,null,null,null,12,137,111,82,57,37,25,19,null,12,125,null,null,null,{"$f":"INDEX({\"A\";\"B\";\"C\";\"D\";\"E\";\"F\";\"G\"},4)","v":"D"},"=INDEX({\"A\";\"B\";\"C\";\"D\";\"E\";\"F\";\"G\"};4)"]
[null,null,"Input",null,null,null,null,null,null,null,null,15,115,88,59,41,29,20,16,null,15,75]
[null,null,"Formel",null,null,null,null,null,null,null,null,18,91,68,44,33,25,17,14,null,18,51,null,null,null,"Udfordringen er selvfølgelig at finde en metode til at gøre referenceområdet (ovenfor D3:D12) "]
[null,null,null,null,null,null,null,null,null,null,null,21,72,53,37,28,22,15,12,null,21,35,null,null,null,"dynamisk, altså sådan at det ændrer sig til den relevante kolonne afhængig af, hvad der"]
[null,"Dybde",null,null,null,null,{"$f":"PlanLægning!B11","v":20},{"$f":"PlanLægning!F11","v":18},{"$f":"PlanLægning!J11","v":30},null,null,24,57,42,30,24,20,13,11,null,24,25,null,null,null,"indtastes i G16 og G17. Hertil bruges følgende formel:"]
[null,"Bundtid",null,null,null,null,{"$f":"PlanLægning!B12","v":28},30,{"$f":"PlanLægning!J12","v":8},null,null,27,47,35,26,21,18,12,10,null,27,20]
[null,null,null,null,null,null,null,null,null,null,null,30,40,30,23,19,16,11,9,null,30,17,null,null,null,"=\"R3C\"&MATCH(MIN(IF(B2:L2>=G16;B2:L2));B2:L2;0)+1&\":R12C\"&MATCH(MIN(IF(B2:L2>=G16;B2:L2));B2:L2;0)+1"]
[null,"(A-G)",null,null,null,null,{"$f":"IF(G19>Main!O22,Trindekompression!K44,INDEX({\"A\";\"B\";\"C\";\"D\";\"E\";\"F\";\"G\"},MATCH(MIN(IF(INDIRECT(G29,0)>=G19,INDIRECT(G29,0))),INDIRECT(G29,0),0)))","v":"D"},{"$f":"INDEX({\"A\";\"B\";\"C\";\"D\";\"E\";\"F\";\"G\"},MATCH(MIN(IF(INDIRECT(K29,0)>=H19+G37,INDIRECT(K29,0))),INDIRECT(K29,0),0))","v":"E"},{"$f":"INDEX({\"A\";\"B\";\"C\";\"D\";\"E\";\"F\";\"G\"},MATCH(MIN(IF(INDIRECT(N29,0)>=I19+L37,INDIRECT(N29,0))),INDIRECT(N29,0),0))","v":"D"},null,null,33,35,27,21,17,14,10,8,null,33,14]
[null,null,null,null,null,null,null,null,null,null,null,36,31,24,19,15,12,9,7,null,36,12,null,null,null,"Den røde del og den grønne del af formlen er identisk med formlen i W4."]
[null,null,null,null,null,null,null,null,null,null,null,39,27,21,17,14,11,8,7,null,39,10,null,null,null,"Den del af formlen der går frem til det andet &-tegn returner derfor tekststrengen: R3C4, og hele"]
[null,"Overfladeinterval-tid",null,null,null,null,{"$f":"Main!E17","v":"01:24:00"},null,{"$f":"Main!H17","v":"01:39:00"},null,null,42,25,19,16,13,10,7,6,null,42,9,null,null,null,"formlen returnerer dermed: R3C4:R12C4 svarende til D3:D12. Denne formel findes i G20, og den vilæ altid returnere"]
[null,null,null,null,null,null,null,null,null,null,null,45,23,17,14,11,9,7,6,null,45,null,null,null,null,"en reference der går fra række 3 til 12 og altid den relevante kolonne baseret på indtastninger i G16 og G17."]
[null,"(A-G, gentagne dyk)",null,null,null,null,{"$f":"LOOKUP(G34,{13;14;15;16;17;18;19},{\"G\";\"F\";\"E\";\"D\";\"C\";\"B\";\"A\"})","v":"A"},null,{"$f":"LOOKUP(K34,{13;14;15;16;17;18;19},{\"G\";\"F\";\"E\";\"D\";\"C\";\"B\";\"A\"})","v":"A"},null,null,"Forbelastning",null,null,null,null,null,null,null,null,null,null,null,null,null,"Denne reference (tekststreng) kan vi benytte ved hjælp af funktionen INDIRECT."]
[]
[null,null,null,null,null,null,null,null,null,null,null,null,null,null,null,null,null,null,null,null,null,null,null,null,null,"I formlen i W8 oven for: =MATCH(MIN(IF(D3:D12>=G17;D3:D12));D3:D12;0) kan vi erstatte referencerne D3:D12 med:"]
[null,"Hjælpeceller:",null,null,null,null,{"$f":"\"R3C\"&MATCH(MIN(IF(B2:L2>=G18,B2:L2)),B2:L2,0)+1&\":R12C\"&MATCH(MIN(IF(B2:L2>=G18,B2:L2)),B2:L2,0)+1","v":"R3C5:R12C5"},null,null,null,{"$f":"\"R3C\"&MATCH(MIN(IF(B2:L2>=H18,B2:L2)),B2:L2,0)+1&\":R12C\"&MATCH(MIN(IF(B2:L2>=H18,B2:L2)),B2:L2,0)+1","v":"R3C4:R12C4"},null,null,{"$f":"\"R3C\"&MATCH(MIN(IF(B2:L2>=I18,B2:L2)),B2:L2,0)+1&\":R12C\"&MATCH(MIN(IF(B2:L2>=I18,B2:L2)),B2:L2,0)+1","v":"R3C8:R12C8"},null,null,"Det opmråde hvori der skal findes den mindste værdi der er større end eller lig med Dybde.",null,null,null,null,null,null,null,null,"=INDIRECT(G20;0). Formlen i W8 ser herefter således ud:"]
[null,null,null,null,null,null,{"$f":"MATCH(MIN(IF(INDIRECT(G29,0)>=G19,INDIRECT(G29,0))),INDIRECT(G29,0),0)+2","v":6},null,null,null,{"$f":"MATCH(MIN(IF(INDIRECT(K29,0)>=H19,INDIRECT(K29,0))),INDIRECT(K29,0),0)+2","v":6},null,null,{"$f":"MATCH(MIN(IF(INDIRECT(N29,0)>=I19,INDIRECT(N29,0))),INDIRECT(N29,0),0)+2","v":3},null,null,"Den række (regnet fra række 1 og kolonnen nævnt i G29) hvor den mindste værdi der er større"]
[null,null,null,null,null,null,null,null,null,null,null,null,null,null,null,null,"end eller lig med Dybde findes.",null,null,null,null,null,null,null,null,"=MATCH(MIN(IF(INDIRECT(G20;0)>=G17;INDIRECT(G20;0)));INDIRECT(G20;0);0) som returnerer 4."]
[null,null,null,null,null,null,{"$f":"\"R\"&G30&\"C\"&13+LOOKUP(G30,{3;4;5;6;7;8;9},{6;5;4;3;2;1;0})&\":R\"&G30&\"C20\"","v":"R6C16:R6C20"},null,null,null,{"$f":"\"R\"&K30&\"C\"&13+LOOKUP(K30,{3;4;5;6;7;8;9},{6;5;4;3;2;1;0})&\":R\"&K30&\"C20\"","v":"R6C16:R6C20"},null,null,{"$f":"\"R\"&N30&\"C\"&13+LOOKUP(N30,{3;4;5;6;7;8;9},{6;5;4;3;2;1;0})&\":R\"&N30&\"C20\"","v":"R3C19:R3C20"},null,null,"Det opmråde hvori der skal findes den mindste værdi der er større end eller lig med Overfladeinterval-tid."]
[null,null,null,null,null,null,{"$f":"MATCH(MIN(IF(--(RIGHT(INDIRECT(G32,0),4))>=G24,--RIGHT(INDIRECT(G32,0),4))),--RIGHT(INDIRECT(G32,0),4),0)","v":4},null,null,null,{"$f":"MATCH(MIN(IF(--(RIGHT(INDIRECT(K32,0),4))>=I24,--RIGHT(INDIRECT(K32,0),4))),--RIGHT(INDIRECT(K32,0),4),0)","v":4},null,null,null,null,null,"Offset-værdien i forhol til den første kolonnereference i G32.",null,null,null,null,null,null,null,null,"Nu er der tilbage bare at oprette en INDEX-funktion som vist i X14, hvor andet argument erstattes af udtrykket i W31."]
[null,null,null,null,null,null,{"$f":"12+LOOKUP(G30,{3;4;5;6;7;8;9},{6;5;4;3;2;1;0})+G33","v":19},null,null,null,{"$f":"12+LOOKUP(K30,{3;4;5;6;7;8;9},{6;5;4;3;2;1;0})+K33","v":19},null,null,null,null,null,"Hvilken kolonne findes Overfladeinterval-tiden i."]
[null,null,null,null,null,null,null,null,null,null,null,null,null,null,null,null,null,null,null,null,null,null,null,null,null,"Bemærk at formlerne i G18 og G20 begge er matrixformler."]
[]
[null,"Forbelastning: (RNT)",null,null,null,null,{"$f":"INDEX($L$13:$S$25,MATCH(X5,$L$13:$L$25,0),MATCH(G26,$L$13:$S$13,0))","v":14},null,null,null,null,{"$f":"INDEX($L$13:$S$25,MATCH(Y5,$L$13:$L$25,0),MATCH(I26,$L$13:$S$13,0))","v":9}]
[null,null,null,null,null,null,null,null,null,null,null,null,null,null,null,null,null,null,null,null,null,null,{"$f":"Main!E20","v":44},null,null,{"$f":"MAX(IF(B2:L2<=G18,B2:L2))","v":18}]

{"sheet":"Trindekompression","index":3,"n_rows":45,"n_cols":13,"rows_kept":45,"cut":false,"hidden":false,"merged":[[0,2,0,5],[0,6,2,6],[1,2,1,5],[0,0,2,0],[0,1,2,1]]}
["Dybde","Tid","Dekompressionsstop",null,null,null,"Mætningsgruppe"]
[null,null,"luft"]
[null,null,12,9,6,"4,5"]
[12,150,null,null,null,1,"G"]
[15,90,null,null,null,5,"G"]
[18,60,null,null,null,6,"F"]
[{"$f":"A6","v":18},70,null,null,null,1,"G"]
[18,80,null,null,null,16,"G"]
[21,50,null,null,null,10,"F"]
[{"$f":"A9","v":21},60,null,null,null,17,"G"]
[21,70,null,null,null,24,"H"]
[21,80,null,null,null,35,"H"]
[24,40,null,null,null,11,"F"]
[{"$f":"A13","v":24},50,null,null,null,19,"G"]
[24,60,null,null,1,28,"G"]
[24,70,null,null,3,38,"G"]
[27,30,null,null,null,9,"F"]
[{"$f":"A17","v":27},40,null,null,null,17,"G"]
[27,50,null,null,3,26,"G"]
[27,60,null,2,4,38,"H"]
[30,25,null,null,null,9,"E"]
[{"$f":"A21","v":30},30,null,null,1,12,"F"]
[30,40,null,1,3,22,"G"]
[30,50,null,4,4,35,"H"]
[33,25,null,null,1,11,"F"]
[{"$f":"A25","v":33},30,null,1,2,16,"G"]
[33,40,null,4,4,27,"G"]
[33,50,null,8,6,41,"H"]
[36,20,null,null,1,9,"E"]
[{"$f":"A29","v":36},25,null,1,2,14,"F"]
[36,30,null,3,3,18,"G"]
[36,40,1,7,4,34,"G"]
[36,50,4,10,6,48,"H"]
[39,15,null,null,1,6,"F"]
[{"$f":"A34","v":39},20,null,1,2,11,"F",null,null,null,"1. Dyk","2. dyk","3. Dyk"]
[39,25,null,3,2,17,"G",null,null,null,"input"]
[39,30,1,4,4,23,"G",null,"dykkedybden",null,{"$f":"PlanLægning!B11","v":20},{"$f":"Main!E22","v":19},{"$f":"Main!H22","v":31}]
[39,40,4,7,6,41,"H",null,"bundtid",null,{"$f":"PlanLægning!B12","v":28},{"$f":"Main!E13","v":30},{"$f":"Main!H13","v":16}]
[42,15,null,null,2,7,"E",null,null,null,"Output"]
[{"$f":"A39","v":42},20,null,2,2,12,"F",null,"tiden på 12 mt"," =",{"$f":"(OFFSET($A$3,MIN(IF(($A$4:$A$45>=$K$37)*($B$4:$B$45>=$K$38),ROW($A$4:$A$45)-CELL(\"row\",$A$4:$A$45)+1)),ROWS($1:2),,))","v":0},{"$f":"(OFFSET($A$3,MIN(IF(($A$4:$A$45>=$L$37)*($B$4:$B$45>=$L$38),ROW($A$4:$A$45)-CELL(\"row\",$A$4:$A$45)+1)),ROWS($1:2),,))","v":0},{"$f":"(OFFSET($A$3,MIN(IF(($A$4:$A$45>=$M$37)*($B$4:$B$45>=$M$38),ROW($A$4:$A$45)-CELL(\"row\",$A$4:$A$45)+1)),ROWS($1:2),,))","v":0}]
[42,25,1,4,3,18,"G",null,"tiden på 9 m."," =",{"$f":"(OFFSET($A$3,MIN(IF(($A$4:$A$45>=$K$37)*($B$4:$B$45>=$K$38),ROW($A$4:$A$45)-CELL(\"row\",$A$4:$A$45)+1)),ROWS($1:3),,))","v":0},{"$f":"(OFFSET($A$3,MIN(IF(($A$4:$A$45>=$L$37)*($B$4:$B$45>=$L$38),ROW($A$4:$A$45)-CELL(\"row\",$A$4:$A$45)+1)),ROWS($1:3),,))","v":0},{"$f":"(OFFSET($A$3,MIN(IF(($A$4:$A$45>=$M$37)*($B$4:$B$45>=$M$38),ROW($A$4:$A$45)-CELL(\"row\",$A$4:$A$45)+1)),ROWS($1:3),,))","v":0}]
[42,30,3,6,4,26,"G",null,"tiden på 6 m."," =",{"$f":"(OFFSET($A$3,MIN(IF(($A$4:$A$45>=$K$37)*($B$4:$B$45>=$K$38),ROW($A$4:$A$45)-CELL(\"row\",$A$4:$A$45)+1)),ROWS($1:4),,))","v":0},{"$f":"(OFFSET($A$3,MIN(IF(($A$4:$A$45>=$L$37)*($B$4:$B$45>=$L$38),ROW($A$4:$A$45)-CELL(\"row\",$A$4:$A$45)+1)),ROWS($1:4),,))","v":0},{"$f":"(OFFSET($A$3,MIN(IF(($A$4:$A$45>=$M$37)*($B$4:$B$45>=$M$38),ROW($A$4:$A$45)-CELL(\"row\",$A$4:$A$45)+1)),ROWS($1:4),,))","v":1}]
[45,10,null,null,null,4,"E",null,"tiden på 4,5m."," =",{"$f":"(OFFSET($A$3,MIN(IF(($A$4:$A$45>=$K$37)*($B$4:$B$45>=$K$38),ROW($A$4:$A$45)-CELL(\"row\",$A$4:$A$45)+1)),ROWS($1:5),,))","v":10},{"$f":"(OFFSET($A$3,MIN(IF(($A$4:$A$45>=$L$37)*($B$4:$B$45>=$L$38),ROW($A$4:$A$45)-CELL(\"row\",$A$4:$A$45)+1)),ROWS($1:5),,))","v":10},{"$f":"(OFFSET($A$3,MIN(IF(($A$4:$A$45>=$M$37)*($B$4:$B$45>=$M$38),ROW($A$4:$A$45)-CELL(\"row\",$A$4:$A$45)+1)),ROWS($1:5),,))","v":11}]
[{"$f":"A43","v":45},15,null,1,2,8,"E",null,"mætninggr."," =",{"$f":"(OFFSET($A$3,MIN(IF(($A$4:$A$45>=$K$37)*($B$4:$B$45>=$K$38),ROW($A$4:$A$45)-CELL(\"row\",$A$4:$A$45)+1)),ROWS($1:6),,))","v":"F"},{"$f":"(OFFSET($A$3,MIN(IF(($A$4:$A$45>=$L$37)*($B$4:$B$45>=$L$38),ROW($A$4:$A$45)-CELL(\"row\",$A$4:$A$45)+1)),ROWS($1:6),,))","v":"F"},{"$f":"(OFFSET($A$3,MIN(IF(($A$4:$A$45>=$M$37)*($B$4:$B$45>=$M$38),ROW($A$4:$A$45)-CELL(\"row\",$A$4:$A$45)+1)),ROWS($1:6),,))","v":"F"}]
[45,20,1,3,2,15,"F"]

{"sheet":"Setup","index":4,"n_rows":22,"n_cols":9,"rows_kept":22,"cut":false,"hidden":false,"merged":[]}
["Flasker type","Flaske størrelse","Vejret","Vægt","Starttryk","Sluttryk","Dykker dragt","Dyk type","Sigtbarhed"]
[]
["Aluminium",2,"Diset",1,100,0,"1 delt Våddragt","Sikkerhedsstop","God"]
["Stål",3,"Klart",2,110,10,"2 delt Våddragt","Tvungen Deco","Gennemsnit"]
["Carbon",4,"Regn",3,120,20,"Semi-Dry","Computerdyk","Dårlig"]
[null,7,"Skyet",4,130,30,"Shorty"]
[null,8,"Sne",5,140,40,"Tørdragt"]
[null,10,"Storm",6,150,50,"Uden Dragt"]
[null,11,"Solskin",7,160,60]
[null,12,null,8,170,70]
[null,15,null,9,180,80]
[null,18,null,10,190,90]
[null,20,null,11,200,100]
[null,24,null,12,210,110]
[null,null,null,13,220,120]
[null,null,null,14,230,130]
[null,null,null,15,240,140]
[null,null,null,null,250,150]
[null,null,null,null,260]
[null,null,null,null,270]
[null,null,null,null,280]
[null,null,null,null,290]

{"sheet":"Ilt forbrug","index":5,"n_rows":51,"n_cols":37,"rows_kept":51,"cut":false,"hidden":false,"merged":[[0,0,0,3],[0,8,0,10],[14,18,14,19]]}
["Find dit forventetede forbrug i liter for planlagt dyk:",null,null,null,null,null,null,null,"Hvilken flaske kræves til dette dyk.",null,null,null,null,"Maks bundtid ",null,null,null,null,null,"Reservetryk",50]
["Dit kendte-",null,null,null,null,null,null,null,null,null,null,null,null,null,null,null,null,null,null,null,null,null,12,15,18,21,24,27,30,33,36,39,42]
["Luftforbrug pr minut ved overfladen:",null,null,null,25,"liter/minuttet",null,null,"dykdybde:",39,null,null,null,"forbrug i overfladen",20,"l/min"]
[]
["Forventet dykdybde m.:",null,null,16,null,null,null,null,"bundtid:",20,null,null,null,"flaske antal",2,"stk.",null,null,null,null,"Meter","Maks tid uden DEKO"]
[null,null,null,null,null,null,null,null,null,null,null,null,null,"flaskestørrelse",15,"liter",null,null,null,null,12,125]
["forventet dyktid min.:",null,null,26,null,null,null,null,"opstigningstid:",{"$f":"ROUNDUP((J3-4.5)/10,0)+1+4","v":9},null,null,null,"fyldningstryk",195,"bar",null,null,null,null,15,75]
[null,null,null,null,null,null,null,null,null,null,null,null,null,"Reservetryk",50,"bar",null,null,null,null,18,51]
["Forventet luft forbrug ved dykket:",null,null,null,{"$f":"D7*E3*(D5/10+1)","v":1690},"liter",null,null,"dyktid ",{"$f":"J5+J7","v":29},null,null,null,"Luft til rådighed",{"$f":"O7-O8","v":145},"bar",null,null,null,null,21,35]
[null,null,null,null,null,null,null,null,null,null,null,null,null,null,null,null,null,null,null,null,24,25]
[null,null,null,null,null,null,null,null,"forventet forbrug i liter:",{"$f":"E3*J9*((J3/10)+1)","v":3552.5000000000005},null,null,null,"Maks fyldning",{"$f":"O7*O6*O5","v":5850},"liter",null,null,null,null,27,20]
["Hvor dybt kan jeg dykke med denne flaske",null,null,null,null,null,null,null,null,null,null,null,null,"Reserve",{"$f":"O6*O8","v":750},"liter",null,null,null,null,30,17]
[null,null,null,null,null,null,null,null,"størrelse på flaske:",{"$f":"J11/200","v":17.762500000000003},null,null,null,"Luft til rådighed",{"$f":"O6*O5*O9","v":4350},"liter",{"$f":"O5*O6*(O7-O8)","v":4350},null,null,null,33,14]
["flaske størrelse",null,15,null,null,null,null,null,null,null,null,null,null,"dykdybde",24,"m",null,null,null,null,36,12]
["Fyldningstryk",null,200,{"$f":"C14*200","v":3000},"bar",null,null,null,null,null,null,null,null,"bundtid",20,"min.","Resttryk: ",{"$f":"(O6*O7-O18)/O6","v":77.13333333333334},"bar",null,39,10]
["Reserve",null,null,{"$f":"C14*50","v":750},"bar",null,null,null,null,null,null,null,null,null,{"$f":"(O14+10)/10","v":3.4},"bar",null,null,null,null,42,9]
["til rådighed",null,null,{"$f":"C14*150","v":2250},"bar",null,null,null,"Find dit forbrug i liter og liter/min. I overfladen",null,null,null,null,"dyktid",{"$f":"O15+O26+O27+O28","v":26},"min.",{"$f":"O3*O15*O16","v":1360},"liter",null,null,45]
["dyktid",null,20,null,null,null,null,null,null,null,null,null,null,"beregning af luftforbrug ialt:",{"$f":"O17*O3*O16","v":1768},"liter",{"$f":"(O26+O27+O28)*O3*Q27","v":174},"liter"]
[null,null,null,null,null,null,null,null,"input",null,null,null,null,null,{"$f":"O16*O3","v":68},"l/min",{"$f":"SUM(Q17:Q18)","v":1534},"liter",null,null,{"$f":"MIN(IF(W2:AG2>=O14,W2:AG2))","v":24}]
["maks dybde med denne flaske:",null,null,null,null,null,null,null,"dyktiden:",20,"min",null,null,"Maks bundtid",{"$f":"ROUNDDOWN(O13/O19,0)","v":63},"min."]
[null,null,null,null,null,null,null,null,null,null,null,null,null,"Maks bundtid uden deko på denne dybde",{"$f":"VLOOKUP(U19,U6:V17,2,0)","v":25},"min."]
[null,null,null,null,null,null,null,null,"dykdybden:",20,"meter."]
[null,"Meter","Opstig","bundtid",null,"maks bundtid"]
[null,12,null,{"$f":"$C$18-C25","v":15},{"$f":"$E$3*C18*2","v":1000},125,null,null,"forbrug:",140,"bar"]
[null,null,{"$f":"ROUNDUP((B24-4.5)/10,0)+4","v":5},null,null,null,null,null,null,null,null,null,null,null,"tid","dybde","tryk","Liter"]
[null,15,null,{"$f":"$C$18-C27","v":14},{"$f":"$E$3*C18*3","v":1500},75,null,null,"flaske størrelse:",10,"liter",null,null,{"$f":"\"Opstigning fra \"&O14&\"m til 4,5m\"","v":"Opstigning fra 24m til 4,5m"},{"$f":"ROUNDUP((O14-4.5)/10,0)","v":2},{"$f":"ROUNDUP(O14-(O14-4.5)/2,0)","v":15},{"$f":"1+P26*0.1","v":2.5},{"$f":"O26*Q26*$O$3*2","v":200}]
[null,null,{"$f":"ROUNDUP((B26-4.5)/10,0)+4","v":6},null,null,null,null,null,"output",null,null,null,null,"Ophold på sikkerhedsstoppet",3,4.5,{"$f":"1+P27*0.1","v":1.45},{"$f":"O27*Q27*$AK$32*2","v":348}]
[null,18,null,{"$f":"$C$18-C29","v":14},{"$f":"$E$3*C18*4","v":2000},51,null,null,"forbrugt i liter.",{"$f":"J24*J26","v":1400},null,null,null,"Opstigning til overfladen",1,2.25,{"$f":"1+P28*0.1","v":1.2250000000000001},{"$f":"O28*Q28*$AK$32*2","v":98}]
[null,null,{"$f":"ROUNDUP((B28-4.5)/10,0)+4","v":6},null,null,null,null,null,null,null,null,null,null,null,null,null,"Liter",{"$f":"ROUNDUP(R26+R27+R28,0)","v":646}]
[null,21,null,{"$f":"$C$18-C31","v":14},{"$f":"$E$3*$C$18*5","v":2500},35,null,null,"forbrug i overfladen:",{"$f":"J28/J20/(J22/10+1)","v":23.333333333333332},"l/min.",null,null,"Minimumstryk",null,null,"bar",{"$f":"ROUNDUP(R29/(O6*O5),0)","v":22}]
[null,null,{"$f":"ROUNDUP((B30-4.5)/10,0)+4","v":6}]
[null,24,null,{"$f":"$C$18-C33","v":14},{"$f":"$E$3*$C$18*6","v":3000},25,null,null,null,null,null,null,null,null,null,null,null,null,null,null,null,null,null,null,null,null,null,null,null,null,null,null,null,null,null,null,40]
[null,null,{"$f":"ROUNDUP((B32-4.5)/10,0)+4","v":6},null,null,null,null,null,"Find din dyktid",null,null,null,null,"EAD"]
[null,27,null,{"$f":"$C$18-C35","v":13},{"$f":"$E$3*$C$18*((B34/10)+1)","v":1850},20,null,null,null,null,null,null,null,"FO2",0.32]
[null,null,{"$f":"ROUNDUP((B34-4.5)/10,0)+4","v":7},null,null,null,null,null,"Dit kendte forbrug-",null,null,null,null,"dybde i meter",30]
[null,30,null,{"$f":"$C$18-C37","v":13},{"$f":"$E$3*$C$18*((B36/10)+1)","v":2000},17,null,null,"liter/ minut i overfladen",20,"liter",null,null,"Lufttabel meter",{"$f":"INT((1-O34)*(O35+10)/0.79-10)","v":24}]
[null,null,{"$f":"ROUNDUP((B36-4.5)/10,0)+4","v":7},null,null,null,null,null,"input"]
[null,33,null,{"$f":"$C$18-C39","v":13},{"$f":"$E$3*$C$18*((B38/10)+1)","v":2150},14,null,null,"flaske størrelsen:",10,"liter"]
[null,null,{"$f":"ROUNDUP((B38-4.5)/10,0)+4","v":7},null,null,null,null,null,null,null,null,null,null,"MOD Maksimale operations dybde"]
[null,36,null,{"$f":"$C$18-C41","v":12},{"$f":"$E$3*$C$18*((B40/10)+1)","v":2300},12,null,null,"forbrug  ",1400,"liter",null,null,"dybde",33]
[null,null,{"$f":"ROUNDUP((B40-4.5)/10,0)+4","v":8},null,null,null,null,null,null,null,null,null,null,"flaskestørrelse i liter",15]
[null,39,null,{"$f":"$C$18-C43","v":12},{"$f":"$E$3*$C$18*((B42/10)+1)","v":2450},10,null,null,"dybde",20,"meter",null,null,"fyldnings tryk",210]
[null,null,{"$f":"ROUNDUP((B42-4.5)/10,0)+4","v":8},null,null,null,null,null,"output",null,null,null,null,"reservetryk",50]
[null,42,null,{"$f":"$C$18-C45","v":12},{"$f":"$E$3*$C$18*((B44/10)+1)","v":2600},9,null,null,"dyktid i minutter",{"$f":"ROUNDUP(J40/(J42/10+1)/J36,0)","v":24},"minutter",null,null,"luft/min",20]
[null,null,{"$f":"ROUNDUP((B44-4.5)/10,0)+4","v":8}]
[null,null,null,null,null,null,null,null,null,null,null,null,null,"NITROX",{"$f":"1.4/((O40/10)+1)","v":0.32558139534883718},{"$f":"INT(O46*100)","v":32}]
[null,null,null,null,null,null,null,null,"BAR",null,null,null,null,null,{"$f":"1.4/O46","v":4.3},"bar"]
[null,null,null,null,null,null,null,null,null,{"$f":"O42-O43","v":160},"bar",null,null,"MOD meter",{"$f":"(O47-1)*10","v":33}]
[null,null,null,null,null,null,null,null,null,{"$f":"O41","v":15},"liter"]
[null,null,null,null,null,null,null,null,null,{"$f":"J48*J49","v":2400},"i alt liter"]
[null,null,null,null,null,null,null,null,"dyktid i min.",{"$f":"INT(J50/(O44*O47))","v":27}]

{"sheet":"Ark2","index":6,"n_rows":15,"n_cols":10,"rows_kept":15,"cut":false,"hidden":false,"merged":[]}
[]
[]
[]
[]
[null,null,null,null,null,null,null,null,null,"4,5 m."]
[]
[]
[null,null,null,null,null,null,null,null,"6 m."]
[]
[]
[null,null,null,null,null,null,null,"9 m."]
[]
[]
[]
[null,null,null,null,null,null,"12 m."]

{"sheet":"Logblad","index":7,"n_rows":11,"n_cols":21,"rows_kept":11,"cut":false,"hidden":false,"merged":[[1,1,1,2]]}
[]
[null,"Dyk nr.:",null,null,null,null,null,null,null,null,null,null,null,null,null,"Dato:"]
[null,"Sted:",null,null,null,null,null,null,null,null,null,null,null,null,null,"Land:"]
[null,"GPS position:",null,null,null,null,null,null,null,null,null,null,null,null,null,"Område:"]
[]
[null,"Start tryk:",null,null,null,null,null,null,null,null,null,null,null,null,null,"Slut tryk:"]
[]
[]
[]
[null,"I overfladen:",null,null,null,null,"Neddrykning:",null,null,null,null,null,"Bundtid:",null,"Opstigningstid:",null,null,null,"I overflden:"]
[null,"Kl.: ",10,":",null,null,"Kl.:",null,":",null,"+",null,"min.","+",null,"min.","=",null,"Kl.:",null,":"]

{"sheet":"PADI lufttabel","index":8,"n_rows":37,"n_cols":18,"rows_kept":37,"cut":false,"hidden":false,"merged":[]}
[]
["feet",35,40,50,6,70,80,90,100,110,120,130,140]
["meter",10,12,15,18,21,24,27,30,33,36,39,42]
[null,10,9,7,6,5,4,4,3,3,3,3,null,"A"]
[null,19,16,13,11,9,8,7,6,6,5,5,4,"B"]
[null,25,22,17,14,12,10,9,8,7,6,6,5,"C"]
[null,29,25,19,16,13,11,10,9,8,7,7,6,"D"]
[null,32,27,21,17,15,13,11,10,9,8,null,7,"E"]
[null,36,31,24,19,16,14,12,11,10,9,8,8,"F"]
[null,40,34,26,21,18,15,13,12,11,10,9,null,"G"]
[null,44,37,28,23,19,17,15,13,12,11,10,null,"H"]
[null,48,40,31,25,21,1,16,14,13]
[]
[]
[]
[]
[]
[]
[]
[]
[]
[]
[]
[]
[]
[]
[]
[]
[]
[]
[]
[]
[]
[]
[]
[]
[null,null,null,null,null,null,null,null,null,null,null,null,null,null,null,null,36,31]

{"sheet":"Dykkerlederjournal","index":9,"n_rows":21,"n_cols":21,"rows_kept":21,"cut":false,"hidden":false,"merged":[[17,15,17,16],[15,15,15,16],[16,0,16,3],[16,7,16,8],[16,9,16,10],[16,11,16,12],[16,13,16,14],[16,15,16,16],[15,0,15,3],[15,7,15,8],[15,9,15,10],[15,11,15,12],[15,13,15,14],[17,0,17,3],[17,7,17,8],[17,9,17,10],[17,11,17,12],[17,13,17,14],[21,13,21,14],[21,15,21,16],[19,15,19,16],[20,0,21,3],[20,7,20,8],[20,9,20,10],[20,11,20,12],[20,13,20,14],[20,15,20,16],[21,7,21,8],[21,9,21,10],[21,11,21,12],[18,0,19,3],[18,7,18,8],[18,9,18,10],[18,11,18,12],[18,13,18,14],[18,15,18,16],[19,7,19,8],[19,9,19,10],[19,11,19,12],[19,13,19,14],[12,0,13,1],[12,2,12,4],[12,5,13,5],[12,14,13,14],[12,15,13,15],[12,16,13,16],[12,17,13,17],[12,18,13,18],[12,19,13,19],[13,2,13,4],[10,0,11,1],[10,2,10,4],[10,5,11,5],[10,14,11,14],[10,15,11,15],[10,16,11,16],[10,17,11,17],[10,18,11,18],[10,19,11,19],[11,2,11,4],[8,0,9,1],[8,2,8,4],[8,5,9,5],[8,14,9,14],[8,15,9,15],[8,16,9,16],[8,17,9,17],[8,18,9,18],[8,19,9,19],[9,2,9,4],[6,0,7,1],[6,2,6,4],[6,5,7,5],[6,14,7,14],[6,15,7,15],[6,16,7,16],[6,17,7,17],[6,18,7,18],[6,19,7,19],[7,2,7,4],[4,0,5,1],[4,2,4,4],[4,5,5,5],[4,14,5,14],[4,15,5,15],[4,16,5,16],[4,17,5,17],[4,18,5,18],[4,19,5,19],[5,2,5,4],[0,6,0,14],[0,15,0,17],[0,18,0,20],[1,0,1,1],[1,2,1,4],[2,0,3,1],[2,2,2,4],[2,5,3,5],[2,14,3,14],[2,15,3,15],[2,16,3,16],[2,17,3,17],[2,18,3,18],[2,19,3,19],[3,2,3,4]]}
["Dykkerlederjournal",null,null,null,null,null,"Sted: ___________________________________________",null,null,null,null,null,null,null,null,"Dato: __________",null,null,"Dyk nr.: ________"]
["Dykker­leder",null,"Standby-dykker",null,null,"Hold nr.","Dykkere","D-timer/comp.","Kompas","Flaske str.","Flaske tryk","EANx","MOD","Forbelastning","Max dybde","Bundtid","Opstigningstid incl. dekostop","Neddykning klokken","Aftalt op klokken","I overfladen klokken","Mætnings-gruppe"]
[]
[]
[]
[]
[]
[]
[]
[]
[]
[]
[]
[]
[]
["Genoplivningssæt",null,null,null,null,null,null,"Hold",null,"Bådfører",null,"Lineholder"]
["Flaske 1:   ___________ bar"]
["Flaske 2:  ___________  bar"]
["Kontrollant:"]
[]
["Alarmtelefon:"]

{"sheet":"Todo","index":10,"n_rows":15,"n_cols":2,"rows_kept":15,"cut":false,"hidden":false,"merged":[]}
["Lige en lille liste over udvidelsesideer"]
[]
["Dato","Opgave"]
["2008-12-14","Mulighed for flere oxygen blandinger"]
["2008-12-14","Anvend en smart dykkeralgoritme i stedet for standardtabeller, som supplement"]
["2008-12-14","Sæt konservative tider"]
["2008-12-14","Beregning af luftforbrug"]
[null,"snorkel"]
[null,"luft"]
[null,"rebreahter"]
[null,"nitrox"]
[null,"udskrive logblad"]
[null,"indtaste dykdata"]
[null,"gemme dykdata i database"]
[null,"bruger info"]

{"sheet":"trimix","index":11,"n_rows":51,"n_cols":16,"rows_kept":51,"cut":false,"hidden":false,"merged":[]}
[]
[]
[]
[]
[]
[]
[]
[]
[]
[]
[]
[]
[]
[]
[]
[]
[]
[]
[]
[]
[]
[]
[]
[]
[]
[]
[]
[]
[]
[]
[]
[]
[]
[]
[]
[]
[]
[]
[]
[]
[]
[]
[]
[]
[]
[]
[]
[]
[]
[]
[null,null,null,null,null,null,null,null,null,null,null,null,null,null,null,"Baseret på dykkertabeller fra: http://www.sportsdykker.dk/onlineupdate/filarkiv/Teknisk%20Udvalg/DSFtabel_udg2.pdf"]